ورود به حساب ثبت نام جدید فراموشی کلمه عبور
برای ورود به حساب کاربری خود، نام کاربری و کلمه عبورتان را در زیر وارد کرده و روی “ ورود به حساب” کلیک کنید.





اگر فرم ثبت نام برای شما نمایش داده نمیشود، اینجا را کلیک کنید.









اگر فرم بازیابی کلمه عبور برای شما نمایش داده نمیشود، اینجا را کلیک کنید.





سفارش شبیه سازی مقالات و پایان نامه
انجام پروژه و شبیه سازی با متلب
صفحه 3 از 3 نخست 123
نمایش نتایج: از 21 به 24 از 24
  1. #21
    noavarangermi
    مدیر کل
    تاریخ عضویت
    Mar 2016
    نوشته ها
    580
    118
    373
    با دستور Sudo su می تونید به یوزر روت برید البته باید پسوردش رو بدونید
    نوآوران گرمی | مرجع فیلم های آموزشی و همیار دانشجو
  2. #22
    amirmahdi
    کاربر عادی
    تاریخ عضویت
    Mar 2017
    نوشته ها
    1
    0
    0
    بعد از اینکه دستور ./install رو میزنم خطای permission failed رو میده نمی دونم دلیلش چیه لطفا راهنمایی کنید.
  3. #23
    noavarangermi
    مدیر کل
    تاریخ عضویت
    Mar 2016
    نوشته ها
    580
    118
    373
    خطای permission failed رو زمانی میده که شما با یوزر روت وارد نشده باشید با دستور sudo su وارد یوزر روت بشید بعد دستور install رو بزنید.
    نوآوران گرمی | مرجع فیلم های آموزشی و همیار دانشجو
  4. #24
    pardazeshgar
    کاربر عادی
    تاریخ عضویت
    Aug 2017
    نوشته ها
    1
    0
    0
    با سلام به دوستان نصب ns2 رو مطابق با آموزش سایت و بر روی پلتفرم فدورا 10 (بر روی هاست ویندوز 10 بصورت VM) انجام دادم ولی متاسفانه بعد از اجرای دستور install/. پیام خطایی میگیرم با این مضمون:
    کد:
    	* Build XGraph-12.2 ================================================== ========== configure: error: expected an absolute directory name for --prefix: .. make all-am make[1]: Entering directory `/home/admin/ns-allinone-2.35/xgraph-12.2' gcc -DHAVE_CONFIG_H -I. -g -MT xgraph.o -MD -MP -MF .deps/xgraph.Tpo -c -o xgraph.o xgraph.c make[1]: gcc: Command not found make[1]: *** [xgraph.o] Error 127 make[1]: Leaving directory `/home/admin/ns-allinone-2.35/xgraph-12.2' make: *** [all] Error 2 Can not create xgraph; But xgraph is an optional package, continuing... ================================================== ========== * Build CWeb ================================================== ========== Making cweb gcc -g -c -o ctangle.o ctangle.c make: gcc: Command not found make: *** [ctangle.o] Error 127 cweb failed to make, but it's optional chmod: cannot access `cweave': No such file or directory chmod: cannot access `ctangle': No such file or directory ln: creating symbolic link `cweave': File exists ln: creating symbolic link `ctangle': File exists ================================================== ========== * Build Stanford GraphBase ================================================== ========== Making sgb cc -g -I/usr/local/sgb/include -DDATA_DIRECTORY=\"/usr/local/sgb/data/\" -c gb_io.c make: cc: Command not found make: *** [gb_io.o] Error 127 Unable to create sgb library, but it's optional, so continuing... ================================================== ========== * Build GT-ITM ================================================== ========== sgb lib not found. gt-itm & sgb2ns could not be installed. Continuing.. ================================================== ========== * Build zlib ================================================== ========== Checking for gcc... Building static library libz.a version 1.2.3 with cc. Checking for unistd.h... No. Checking whether to use vs[n]printf() or s[n]printf()... using s[n]printf() Checking for snprintf() in stdio.h... No. WARNING: snprintf() not found, falling back to sprintf(). zlib can build but will be open to possible buffer-overflow security vulnerabilities. Checking for return value of sprintf()... No. WARNING: apparently sprintf() does not return a value. zlib can build but will be open to possible string-format security vulnerabilities. Checking for errno.h... No. Checking for mmap support... No. cc -O -DNO_snprintf -DHAS_sprintf_void -DNO_ERRNO_H -c -o example.o example.c make: cc: Command not found make: *** [example.o] Error 127 Zlib make failed, but it's optional Continue ... ================================================== ========== * Build tcl8.5.10 ================================================== ========== ./install: line 409: autoconf: command not found checking whether to use symlinks for manpages... no checking whether to compress the manpages... no checking whether to add a package name suffix for the manpages... no checking for gcc... no checking for cc... no checking for cc... no checking for cl... no configure: error: no acceptable C compiler found in $PATH See `config.log' for more details.
    اگه میشه راهنمایی بفرمایید مشکل کجاست؟
    ویرایش توسط saeed : 2017/08/13 در ساعت 12:55
صفحه 3 از 3 نخست 123
نمایش نتایج: از 21 به 24 از 24

کلمات کلیدی این موضوع

مجوز های ارسال و ویرایش

  • شما نمیتوانید موضوع جدیدی ارسال کنید
  • شما امکان ارسال پاسخ را ندارید
  • شما نمیتوانید فایل پیوست کنید.
  • شما نمیتوانید پست های خود را ویرایش کنید
  •